{"text_format":"1","workbook":"xlsx","n_sheets":4,"sheets":["نموذج تعبئة فواتير السلف","Barcode","جزء خاص بالمستودع","عبدالرحمن السالم"],"not_rendered":{"charts":0,"images":2,"macros":1,"external_links":2,"defined_names":7,"comments":0,"pivot_tables":0},"unopened":[],"bounds":{"document_bytes":16777216,"sheet_cells":100000,"rows_first":2000,"rows_last":500,"rows_between":2000,"halvings":0,"cell_chars":16384,"cell_head_chars":4096},"cells_cut":0,"cells_raw":0,"read":"whole","date_system":"1900"}

{"sheet":"نموذج تعبئة فواتير السلف","index":0,"n_rows":359,"n_cols":11,"rows_kept":359,"cut":false,"hidden":false,"merged":[[5,0,5,3],[357,8,357,9],[358,0,358,2],[358,5,358,9],[358,3,358,4],[357,0,357,1],[357,2,357,3],[4,0,4,7],[0,2,0,6],[1,0,1,1],[2,0,2,1],[3,0,3,1],[0,7,0,9],[1,3,1,6],[1,8,1,9],[2,7,2,9],[2,2,2,4],[3,6,3,7]]}
[null,"جامعة الملك سعود\nكلية الصيدلة","نموذج تسجيل فواتير السلف لإدخالها في نظام ( مدار )",null,null,null,null,"اعداد الموظف: عبدالرحمن عبدالعزيز السالم\nللملاحظات على النموذج: aaalsalem@ksu.edu.sa",null,null,2]
["أدخل الرقم الوظيفي للمستلم",null,null,{"$f":"IFERROR(VLOOKUP(C2,'عبدالرحمن السالم'!$B$2:$C$870,2,0),\"اسم المستلم\")","v":"اسم المستلم"},null,null,null,"رقم الجوال"]
["نوع السلفة أو اسم المشروع",null,null,null,null,"مبلغ السلفة",99999,{"$f":"NumberToText(G3,\"ريال\",\"هللة\")","v":"تسعة وتسعون ألف وتسعمائة وتسعة وتسعون ريال"}]
["الرقم الخاص",null,"تاريخ طباعة المحضر",{"$f":"IF(C2<>\"\",TODAY(),\"\")","v":""},"تاريخ انتهاء صلاحية المحضر",{"$f":"IF(C2<>\"\",(D4)+15,\"\")","v":""},"يرجى الإنتباه بأن صلاحية المحضر ستنتهي بعد",null,{"$f":"IF(C2<>\"\",F4-J5,\"(     )\")","v":"(     )"},"يوم من تاريخ طباعة المحضر"]
["يتم ارسال النموذج إلى بريد الإلكتروني التالي: aaalsalem@ksu.edu.sa بعد تعبئة الخانات المحددة باللون الأخضر فقط",null,null,null,null,null,null,null,"تاريخ اليوم",{"$f":"TODAY()","v":"2021-07-20"}]
["الـــــمـــــــجـــــمــــــــوع",null,null,null,{"$f":"SUBTOTAL(109,الجدول1[الإجمالي بدون ضريبة])","v":0},null,{"$f":"SUBTOTAL(109,الجدول1[مبلغ الضريبة])","v":0},{"$f":"SUBTOTAL(109,الجدول1[الإجمالي شامل الضريبة])","v":0},"الوقت الآن",{"$f":"NOW()","v":44397.826102314815}]
["م","أسم الصنف","الكمية","المبلغ الإفرادي","الإجمالي بدون ضريبة","اختر نسبة الضريبة","مبلغ الضريبة","الإجمالي شامل الضريبة","اختر نوع الصنف","رقم التعريف"]
[{"$f":"ROW(الجدول1[[#This Row],[أسم الصنف]])-7","v":1},"صنف رقم 1",null,null,{"$f":"C8*D8","v":0},"15%",{"$f":"H8-E8","v":0},{"$f":"E8+(E8*F8)","v":0},"مستهلك"]
[{"$f":"ROW(الجدول1[[#This Row],[أسم الصنف]])-7","v":2},"صنف رقم 2",null,null,0,"15%",0,0,"مستهلك"]
[{"$f":"ROW(الجدول1[[#This Row],[أسم الصنف]])-7","v":3},"صنف رقم 3",null,null,0,"15%",0,0,"مستهلك"]
[{"$f":"ROW(الجدول1[[#This Row],[أسم الصنف]])-7","v":4},"صنف رقم 4",null,null,0,"15%",0,0,"مستهلك"]
[{"$f":"ROW(الجدول1[[#This Row],[أسم الصنف]])-7","v":5},"صنف رقم 5",null,null,0,"15%",0,0,"مستهلك"]
[{"$f":"ROW(الجدول1[[#This Row],[أسم الصنف]])-7","v":6},"صنف رقم 6",null,null,0,"15%",0,0,"مستهلك"]
[{"$f":"ROW(الجدول1[[#This Row],[أسم الصنف]])-7","v":7},"صنف رقم 7",null,null,0,"15%",0,0,"مستهلك"]
[{"$f":"ROW(الجدول1[[#This Row],[أسم الصنف]])-7","v":8},"صنف رقم 8",null,null,0,"15%",0,0,"مستهلك"]
[{"$f":"ROW(الجدول1[[#This Row],[أسم الصنف]])-7","v":9},"صنف رقم 9",null,null,0,"15%",0,0,"مستهلك"]
[{"$f":"ROW(الجدول1[[#This Row],[أسم الصنف]])-7","v":10},"صنف رقم 10",null,null,0,"15%",0,0,"مستهلك"]
[{"$f":"ROW(الجدول1[[#This Row],[أسم الصنف]])-7","v":11},"صنف رقم 11",null,null,0,"15%",0,0,"مستهلك"]
[{"$f":"ROW(الجدول1[[#This Row],[أسم الصنف]])-7","v":12},"صنف رقم 12",null,null,0,"15%",0,0,"مستهلك"]
[{"$f":"ROW(الجدول1[[#This Row],[أسم الصنف]])-7","v":13},"صنف رقم 13",null,null,0,"15%",0,0,"مستهلك"]
[{"$f":"ROW(الجدول1[[#This Row],[أسم الصنف]])-7","v":14},"صنف رقم 14",null,null,0,"15%",0,0,"مستهلك"]
[{"$f":"ROW(الجدول1[[#This Row],[أسم الصنف]])-7","v":15},"صنف رقم 15",null,null,0,"15%",0,0,"مستهلك"]
[{"$f":"ROW(الجدول1[[#This Row],[أسم الصنف]])-7","v":16},"صنف رقم 16",null,null,0,"15%",0,0,"مستهلك"]
[{"$f":"ROW(الجدول1[[#This Row],[أسم الصنف]])-7","v":17},"صنف رقم 17",null,null,0,"15%",0,0,"مستهلك"]
[{"$f":"ROW(الجدول1[[#This Row],[أسم الصنف]])-7","v":18},"صنف رقم 18",null,null,0,"15%",0,0,"مستهلك"]
[{"$f":"ROW(الجدول1[[#This Row],[أسم الصنف]])-7","v":19},"صنف رقم 19",null,null,0,"15%",0,0,"مستهلك"]
[{"$f":"ROW(الجدول1[[#This Row],[أسم الصنف]])-7","v":20},"صنف رقم 20",null,null,0,"15%",0,0,"مستهلك"]
[{"$f":"ROW(الجدول1[[#This Row],[أسم الصنف]])-7","v":21},"صنف رقم 21",null,null,0,"15%",0,0,"مستهلك"]
[{"$f":"ROW(الجدول1[[#This Row],[أسم الصنف]])-7","v":22},"صنف رقم 22",null,null,0,"15%",0,0,"مستهلك"]
[{"$f":"ROW(الجدول1[[#This Row],[أسم الصنف]])-7","v":23},"صنف رقم 23",null,null,0,"15%",0,0,"مستهلك"]
[{"$f":"ROW(الجدول1[[#This Row],[أسم الصنف]])-7","v":24},"صنف رقم 24",null,null,0,"15%",0,0,"مستهلك"]
[{"$f":"ROW(الجدول1[[#This Row],[أسم الصنف]])-7","v":25},"صنف رقم 25",null,null,0,"15%",0,0,"مستهلك"]
[{"$f":"ROW(الجدول1[[#This Row],[أسم الصنف]])-7","v":26},"صنف رقم 26",null,null,0,"15%",0,0,"مستهلك"]
[{"$f":"ROW(الجدول1[[#This Row],[أسم الصنف]])-7","v":27},"صنف رقم 27",null,null,0,"15%",0,0,"مستهلك"]
[{"$f":"ROW(الجدول1[[#This Row],[أسم الصنف]])-7","v":28},"صنف رقم 28",null,null,0,"15%",0,0,"مستهلك"]
[{"$f":"ROW(الجدول1[[#This Row],[أسم الصنف]])-7","v":29},"صنف رقم 29",null,null,0,"15%",0,0,"مستهلك"]
[{"$f":"ROW(الجدول1[[#This Row],[أسم الصنف]])-7","v":30},"صنف رقم 30",null,null,0,"15%",0,0,"مستهلك"]
[{"$f":"ROW(الجدول1[[#This Row],[أسم الصنف]])-7","v":31},"صنف رقم 31",null,null,0,"15%",0,0,"مستهلك"]
[{"$f":"ROW(الجدول1[[#This Row],[أسم الصنف]])-7","v":32},"صنف رقم 32",null,null,0,"15%",0,0,"مستهلك"]
[{"$f":"ROW(الجدول1[[#This Row],[أسم الصنف]])-7","v":33},"صنف رقم 33",null,null,0,"15%",0,0,"مستهلك"]
{"$rows_left_out":320}
{"sheet":"Barcode","index":1,"n_rows":355,"n_cols":8,"rows_kept":355,"cut":false,"hidden":true,"merged":[[0,6,0,7],[1,6,1,7],[0,0,3,1],[0,2,3,5]]}
["إعداد الموظف:\nعبدالرحمن عبدالعزيز السالم\nجامعة الملك سعود - كلية الصيدلة\n0555178727\naaalsalem@ksu.edu.sa",null,"باركودات فواتير السلف\nBarcode"]
[]
[]
[]
["م","رقم التعريف","باركود رقم التعريف","باركود الكمية","الكمية","باركود السعر الإفرادي","السعر الإفرادي","المجموع"]
[1,{"$f":"'نموذج تعبئة فواتير السلف'!J8","v":0},{"$f":"\"*\"&B6&\"*\"","v":"*0*"},{"$f":"\"*\"&E6&\"*\"","v":"*0*"},{"$f":"'نموذج تعبئة فواتير السلف'!C8","v":0},{"$f":"\"*\"&G6&\"*\"","v":"*0*"},{"$f":"'نموذج تعبئة فواتير السلف'!D8","v":0},{"$f":"'نموذج تعبئة فواتير السلف'!E8","v":0}]
[2,{"$f":"'نموذج تعبئة فواتير السلف'!J9","v":0},"*0*",{"$f":"\"*\"&E7&\"*\"","v":"*0*"},{"$f":"'نموذج تعبئة فواتير السلف'!C9","v":0},{"$f":"\"*\"&G7&\"*\"","v":"*0*"},{"$f":"'نموذج تعبئة فواتير السلف'!D9","v":0},{"$f":"'نموذج تعبئة فواتير السلف'!E9","v":0}]
[3,{"$f":"'نموذج تعبئة فواتير السلف'!J10","v":0},"*0*","*0*",{"$f":"'نموذج تعبئة فواتير السلف'!C10","v":0},"*0*",{"$f":"'نموذج تعبئة فواتير السلف'!D10","v":0},{"$f":"'نموذج تعبئة فواتير السلف'!E10","v":0}]
[4,{"$f":"'نموذج تعبئة فواتير السلف'!J11","v":0},"*0*","*0*",{"$f":"'نموذج تعبئة فواتير السلف'!C11","v":0},"*0*",{"$f":"'نموذج تعبئة فواتير السلف'!D11","v":0},{"$f":"'نموذج تعبئة فواتير السلف'!E11","v":0}]
[5,{"$f":"'نموذج تعبئة فواتير السلف'!J12","v":0},"*0*","*0*",{"$f":"'نموذج تعبئة فواتير السلف'!C12","v":0},"*0*",{"$f":"'نموذج تعبئة فواتير السلف'!D12","v":0},{"$f":"'نموذج تعبئة فواتير السلف'!E12","v":0}]
[6,{"$f":"'نموذج تعبئة فواتير السلف'!J13","v":0},"*0*","*0*",{"$f":"'نموذج تعبئة فواتير السلف'!C13","v":0},"*0*",{"$f":"'نموذج تعبئة فواتير السلف'!D13","v":0},{"$f":"'نموذج تعبئة فواتير السلف'!E13","v":0}]
[7,{"$f":"'نموذج تعبئة فواتير السلف'!J14","v":0},"*0*","*0*",{"$f":"'نموذج تعبئة فواتير السلف'!C14","v":0},"*0*",{"$f":"'نموذج تعبئة فواتير السلف'!D14","v":0},{"$f":"'نموذج تعبئة فواتير السلف'!E14","v":0}]
[8,{"$f":"'نموذج تعبئة فواتير السلف'!J15","v":0},"*0*","*0*",{"$f":"'نموذج تعبئة فواتير السلف'!C15","v":0},"*0*",{"$f":"'نموذج تعبئة فواتير السلف'!D15","v":0},{"$f":"'نموذج تعبئة فواتير السلف'!E15","v":0}]
[9,{"$f":"'نموذج تعبئة فواتير السلف'!J16","v":0},"*0*","*0*",{"$f":"'نموذج تعبئة فواتير السلف'!C16","v":0},"*0*",{"$f":"'نموذج تعبئة فواتير السلف'!D16","v":0},{"$f":"'نموذج تعبئة فواتير السلف'!E16","v":0}]
[10,{"$f":"'نموذج تعبئة فواتير السلف'!J17","v":0},"*0*","*0*",{"$f":"'نموذج تعبئة فواتير السلف'!C17","v":0},"*0*",{"$f":"'نموذج تعبئة فواتير السلف'!D17","v":0},{"$f":"'نموذج تعبئة فواتير السلف'!E17","v":0}]
[11,{"$f":"'نموذج تعبئة فواتير السلف'!J18","v":0},"*0*","*0*",{"$f":"'نموذج تعبئة فواتير السلف'!C18","v":0},"*0*",{"$f":"'نموذج تعبئة فواتير السلف'!D18","v":0},{"$f":"'نموذج تعبئة فواتير السلف'!E18","v":0}]
[12,{"$f":"'نموذج تعبئة فواتير السلف'!J19","v":0},"*0*","*0*",{"$f":"'نموذج تعبئة فواتير السلف'!C19","v":0},"*0*",{"$f":"'نموذج تعبئة فواتير السلف'!D19","v":0},{"$f":"'نموذج تعبئة فواتير السلف'!E19","v":0}]
[13,{"$f":"'نموذج تعبئة فواتير السلف'!J20","v":0},"*0*","*0*",{"$f":"'نموذج تعبئة فواتير السلف'!C20","v":0},"*0*",{"$f":"'نموذج تعبئة فواتير السلف'!D20","v":0},{"$f":"'نموذج تعبئة فواتير السلف'!E20","v":0}]
[14,{"$f":"'نموذج تعبئة فواتير السلف'!J21","v":0},"*0*","*0*",{"$f":"'نموذج تعبئة فواتير السلف'!C21","v":0},"*0*",{"$f":"'نموذج تعبئة فواتير السلف'!D21","v":0},{"$f":"'نموذج تعبئة فواتير السلف'!E21","v":0}]
[15,{"$f":"'نموذج تعبئة فواتير السلف'!J22","v":0},"*0*","*0*",{"$f":"'نموذج تعبئة فواتير السلف'!C22","v":0},"*0*",{"$f":"'نموذج تعبئة فواتير السلف'!D22","v":0},{"$f":"'نموذج تعبئة فواتير السلف'!E22","v":0}]
[16,{"$f":"'نموذج تعبئة فواتير السلف'!J23","v":0},"*0*","*0*",{"$f":"'نموذج تعبئة فواتير السلف'!C23","v":0},"*0*",{"$f":"'نموذج تعبئة فواتير السلف'!D23","v":0},{"$f":"'نموذج تعبئة فواتير السلف'!E23","v":0}]
[17,{"$f":"'نموذج تعبئة فواتير السلف'!J24","v":0},"*0*","*0*",{"$f":"'نموذج تعبئة فواتير السلف'!C24","v":0},"*0*",{"$f":"'نموذج تعبئة فواتير السلف'!D24","v":0},{"$f":"'نموذج تعبئة فواتير السلف'!E24","v":0}]
[18,{"$f":"'نموذج تعبئة فواتير السلف'!J25","v":0},"*0*","*0*",{"$f":"'نموذج تعبئة فواتير السلف'!C25","v":0},"*0*",{"$f":"'نموذج تعبئة فواتير السلف'!D25","v":0},{"$f":"'نموذج تعبئة فواتير السلف'!E25","v":0}]
[19,{"$f":"'نموذج تعبئة فواتير السلف'!J26","v":0},"*0*","*0*",{"$f":"'نموذج تعبئة فواتير السلف'!C26","v":0},"*0*",{"$f":"'نموذج تعبئة فواتير السلف'!D26","v":0},{"$f":"'نموذج تعبئة فواتير السلف'!E26","v":0}]
[20,{"$f":"'نموذج تعبئة فواتير السلف'!J27","v":0},"*0*","*0*",{"$f":"'نموذج تعبئة فواتير السلف'!C27","v":0},"*0*",{"$f":"'نموذج تعبئة فواتير السلف'!D27","v":0},{"$f":"'نموذج تعبئة فواتير السلف'!E27","v":0}]
[21,{"$f":"'نموذج تعبئة فواتير السلف'!J28","v":0},"*0*","*0*",{"$f":"'نموذج تعبئة فواتير السلف'!C28","v":0},"*0*",{"$f":"'نموذج تعبئة فواتير السلف'!D28","v":0},{"$f":"'نموذج تعبئة فواتير السلف'!E28","v":0}]
[22,{"$f":"'نموذج تعبئة فواتير السلف'!J29","v":0},"*0*","*0*",{"$f":"'نموذج تعبئة فواتير السلف'!C29","v":0},"*0*",{"$f":"'نموذج تعبئة فواتير السلف'!D29","v":0},{"$f":"'نموذج تعبئة فواتير السلف'!E29","v":0}]
[23,{"$f":"'نموذج تعبئة فواتير السلف'!J30","v":0},"*0*","*0*",{"$f":"'نموذج تعبئة فواتير السلف'!C30","v":0},"*0*",{"$f":"'نموذج تعبئة فواتير السلف'!D30","v":0},{"$f":"'نموذج تعبئة فواتير السلف'!E30","v":0}]
[24,{"$f":"'نموذج تعبئة فواتير السلف'!J31","v":0},"*0*","*0*",{"$f":"'نموذج تعبئة فواتير السلف'!C31","v":0},"*0*",{"$f":"'نموذج تعبئة فواتير السلف'!D31","v":0},{"$f":"'نموذج تعبئة فواتير السلف'!E31","v":0}]
[25,{"$f":"'نموذج تعبئة فواتير السلف'!J32","v":0},"*0*","*0*",{"$f":"'نموذج تعبئة فواتير السلف'!C32","v":0},"*0*",{"$f":"'نموذج تعبئة فواتير السلف'!D32","v":0},{"$f":"'نموذج تعبئة فواتير السلف'!E32","v":0}]
[26,{"$f":"'نموذج تعبئة فواتير السلف'!J33","v":0},"*0*","*0*",{"$f":"'نموذج تعبئة فواتير السلف'!C33","v":0},"*0*",{"$f":"'نموذج تعبئة فواتير السلف'!D33","v":0},{"$f":"'نموذج تعبئة فواتير السلف'!E33","v":0}]
[27,{"$f":"'نموذج تعبئة فواتير السلف'!J34","v":0},"*0*","*0*",{"$f":"'نموذج تعبئة فواتير السلف'!C34","v":0},"*0*",{"$f":"'نموذج تعبئة فواتير السلف'!D34","v":0},{"$f":"'نموذج تعبئة فواتير السلف'!E34","v":0}]
[28,{"$f":"'نموذج تعبئة فواتير السلف'!J35","v":0},"*0*","*0*",{"$f":"'نموذج تعبئة فواتير السلف'!C35","v":0},"*0*",{"$f":"'نموذج تعبئة فواتير السلف'!D35","v":0},{"$f":"'نموذج تعبئة فواتير السلف'!E35","v":0}]
[29,{"$f":"'نموذج تعبئة فواتير السلف'!J36","v":0},"*0*","*0*",{"$f":"'نموذج تعبئة فواتير السلف'!C36","v":0},"*0*",{"$f":"'نموذج تعبئة فواتير السلف'!D36","v":0},{"$f":"'نموذج تعبئة فواتير السلف'!E36","v":0}]
[30,{"$f":"'نموذج تعبئة فواتير السلف'!J37","v":0},"*0*","*0*",{"$f":"'نموذج تعبئة فواتير السلف'!C37","v":0},"*0*",{"$f":"'نموذج تعبئة فواتير السلف'!D37","v":0},{"$f":"'نموذج تعبئة فواتير السلف'!E37","v":0}]
[31,{"$f":"'نموذج تعبئة فواتير السلف'!J38","v":0},"*0*","*0*",{"$f":"'نموذج تعبئة فواتير السلف'!C38","v":0},"*0*",{"$f":"'نموذج تعبئة فواتير السلف'!D38","v":0},{"$f":"'نموذج تعبئة فواتير السلف'!E38","v":0}]
[32,{"$f":"'نموذج تعبئة فواتير السلف'!J39","v":0},"*0*","*0*",{"$f":"'نموذج تعبئة فواتير السلف'!C39","v":0},"*0*",{"$f":"'نموذج تعبئة فواتير السلف'!D39","v":0},{"$f":"'نموذج تعبئة فواتير السلف'!E39","v":0}]
[33,{"$f":"'نموذج تعبئة فواتير السلف'!J40","v":0},"*0*","*0*",{"$f":"'نموذج تعبئة فواتير السلف'!C40","v":0},"*0*",{"$f":"'نموذج تعبئة فواتير السلف'!D40","v":0},{"$f":"'نموذج تعبئة فواتير السلف'!E40","v":0}]
[34,{"$f":"'نموذج تعبئة فواتير السلف'!J41","v":0},"*0*","*0*",{"$f":"'نموذج تعبئة فواتير السلف'!C41","v":0},"*0*",{"$f":"'نموذج تعبئة فواتير السلف'!D41","v":0},{"$f":"'نموذج تعبئة فواتير السلف'!E41","v":0}]
[35,{"$f":"'نموذج تعبئة فواتير السلف'!J42","v":0},"*0*","*0*",{"$f":"'نموذج تعبئة فواتير السلف'!C42","v":0},"*0*",{"$f":"'نموذج تعبئة فواتير السلف'!D42","v":0},{"$f":"'نموذج تعبئة فواتير السلف'!E42","v":0}]
{"$rows_left_out":316}
{"sheet":"جزء خاص بالمستودع","index":2,"n_rows":355,"n_cols":6,"rows_kept":355,"cut":false,"hidden":true,"merged":[[0,0,2,1],[0,5,2,5],[0,2,0,4]]}
[null,null,"التحقق من صحة الإدخال",null,null,"إعداد الموظف:\nعبدالرحمن عبدالعزيز السالم\nجامعة الملك سعود - كلية الصيدلة\nللملاحظات على النموذج:\n0555178727\naaalsalem@ksu.edu.sa"]
[null,null,"ضريبة النموذج","ضريبة المحضر","إجمالي المحضر + الضريبة"]
[null,null,{"$f":"'نموذج تعبئة فواتير السلف'!G6","v":0},0,0]
["م","رقم التعريف","مبالغ النموذج","مبالغ المحضر","تحقق","▲ الفرق  ▼"]
[{"$f":"'نموذج تعبئة فواتير السلف'!A8","v":1},{"$f":"'نموذج تعبئة فواتير السلف'!J8","v":0},{"$f":"'نموذج تعبئة فواتير السلف'!E8","v":0},null,{"$f":"IF(F5=0,\"\",CHAR(251))","v":""},{"$f":"الجدول3[[#This Row],[مبالغ النموذج]]-الجدول3[[#This Row],[مبالغ المحضر]]","v":0}]
[{"$f":"'نموذج تعبئة فواتير السلف'!A9","v":2},{"$f":"'نموذج تعبئة فواتير السلف'!J9","v":0},{"$f":"'نموذج تعبئة فواتير السلف'!E9","v":0},null,{"$f":"IF(F6=0,\"\",CHAR(251))","v":""},{"$f":"الجدول3[[#This Row],[مبالغ النموذج]]-الجدول3[[#This Row],[مبالغ المحضر]]","v":0}]
[{"$f":"'نموذج تعبئة فواتير السلف'!A10","v":3},{"$f":"'نموذج تعبئة فواتير السلف'!J10","v":0},{"$f":"'نموذج تعبئة فواتير السلف'!E10","v":0},null,"",{"$f":"الجدول3[[#This Row],[مبالغ النموذج]]-الجدول3[[#This Row],[مبالغ المحضر]]","v":0}]
[{"$f":"'نموذج تعبئة فواتير السلف'!A11","v":4},{"$f":"'نموذج تعبئة فواتير السلف'!J11","v":0},{"$f":"'نموذج تعبئة فواتير السلف'!E11","v":0},null,"",{"$f":"الجدول3[[#This Row],[مبالغ النموذج]]-الجدول3[[#This Row],[مبالغ المحضر]]","v":0}]
[{"$f":"'نموذج تعبئة فواتير السلف'!A12","v":5},{"$f":"'نموذج تعبئة فواتير السلف'!J12","v":0},{"$f":"'نموذج تعبئة فواتير السلف'!E12","v":0},null,"",{"$f":"الجدول3[[#This Row],[مبالغ النموذج]]-الجدول3[[#This Row],[مبالغ المحضر]]","v":0}]
[{"$f":"'نموذج تعبئة فواتير السلف'!A13","v":6},{"$f":"'نموذج تعبئة فواتير السلف'!J13","v":0},{"$f":"'نموذج تعبئة فواتير السلف'!E13","v":0},null,"",{"$f":"الجدول3[[#This Row],[مبالغ النموذج]]-الجدول3[[#This Row],[مبالغ المحضر]]","v":0}]
[{"$f":"'نموذج تعبئة فواتير السلف'!A14","v":7},{"$f":"'نموذج تعبئة فواتير السلف'!J14","v":0},{"$f":"'نموذج تعبئة فواتير السلف'!E14","v":0},null,"",{"$f":"الجدول3[[#This Row],[مبالغ النموذج]]-الجدول3[[#This Row],[مبالغ المحضر]]","v":0}]
[{"$f":"'نموذج تعبئة فواتير السلف'!A15","v":8},{"$f":"'نموذج تعبئة فواتير السلف'!J15","v":0},{"$f":"'نموذج تعبئة فواتير السلف'!E15","v":0},null,"",{"$f":"الجدول3[[#This Row],[مبالغ النموذج]]-الجدول3[[#This Row],[مبالغ المحضر]]","v":0}]
[{"$f":"'نموذج تعبئة فواتير السلف'!A16","v":9},{"$f":"'نموذج تعبئة فواتير السلف'!J16","v":0},{"$f":"'نموذج تعبئة فواتير السلف'!E16","v":0},null,"",{"$f":"الجدول3[[#This Row],[مبالغ النموذج]]-الجدول3[[#This Row],[مبالغ المحضر]]","v":0}]
[{"$f":"'نموذج تعبئة فواتير السلف'!A17","v":10},{"$f":"'نموذج تعبئة فواتير السلف'!J17","v":0},{"$f":"'نموذج تعبئة فواتير السلف'!E17","v":0},null,"",{"$f":"الجدول3[[#This Row],[مبالغ النموذج]]-الجدول3[[#This Row],[مبالغ المحضر]]","v":0}]
[{"$f":"'نموذج تعبئة فواتير السلف'!A18","v":11},{"$f":"'نموذج تعبئة فواتير السلف'!J18","v":0},{"$f":"'نموذج تعبئة فواتير السلف'!E18","v":0},null,"",{"$f":"الجدول3[[#This Row],[مبالغ النموذج]]-الجدول3[[#This Row],[مبالغ المحضر]]","v":0}]
[{"$f":"'نموذج تعبئة فواتير السلف'!A19","v":12},{"$f":"'نموذج تعبئة فواتير السلف'!J19","v":0},{"$f":"'نموذج تعبئة فواتير السلف'!E19","v":0},null,"",{"$f":"الجدول3[[#This Row],[مبالغ النموذج]]-الجدول3[[#This Row],[مبالغ المحضر]]","v":0}]
[{"$f":"'نموذج تعبئة فواتير السلف'!A20","v":13},{"$f":"'نموذج تعبئة فواتير السلف'!J20","v":0},{"$f":"'نموذج تعبئة فواتير السلف'!E20","v":0},null,"",{"$f":"الجدول3[[#This Row],[مبالغ النموذج]]-الجدول3[[#This Row],[مبالغ المحضر]]","v":0}]
[{"$f":"'نموذج تعبئة فواتير السلف'!A21","v":14},{"$f":"'نموذج تعبئة فواتير السلف'!J21","v":0},{"$f":"'نموذج تعبئة فواتير السلف'!E21","v":0},null,"",{"$f":"الجدول3[[#This Row],[مبالغ النموذج]]-الجدول3[[#This Row],[مبالغ المحضر]]","v":0}]
[{"$f":"'نموذج تعبئة فواتير السلف'!A22","v":15},{"$f":"'نموذج تعبئة فواتير السلف'!J22","v":0},{"$f":"'نموذج تعبئة فواتير السلف'!E22","v":0},null,"",{"$f":"الجدول3[[#This Row],[مبالغ النموذج]]-الجدول3[[#This Row],[مبالغ المحضر]]","v":0}]
[{"$f":"'نموذج تعبئة فواتير السلف'!A23","v":16},{"$f":"'نموذج تعبئة فواتير السلف'!J23","v":0},{"$f":"'نموذج تعبئة فواتير السلف'!E23","v":0},null,"",{"$f":"الجدول3[[#This Row],[مبالغ النموذج]]-الجدول3[[#This Row],[مبالغ المحضر]]","v":0}]
[{"$f":"'نموذج تعبئة فواتير السلف'!A24","v":17},{"$f":"'نموذج تعبئة فواتير السلف'!J24","v":0},{"$f":"'نموذج تعبئة فواتير السلف'!E24","v":0},null,"",{"$f":"الجدول3[[#This Row],[مبالغ النموذج]]-الجدول3[[#This Row],[مبالغ المحضر]]","v":0}]
[{"$f":"'نموذج تعبئة فواتير السلف'!A25","v":18},{"$f":"'نموذج تعبئة فواتير السلف'!J25","v":0},{"$f":"'نموذج تعبئة فواتير السلف'!E25","v":0},null,"",{"$f":"الجدول3[[#This Row],[مبالغ النموذج]]-الجدول3[[#This Row],[مبالغ المحضر]]","v":0}]
[{"$f":"'نموذج تعبئة فواتير السلف'!A26","v":19},{"$f":"'نموذج تعبئة فواتير السلف'!J26","v":0},{"$f":"'نموذج تعبئة فواتير السلف'!E26","v":0},null,"",{"$f":"الجدول3[[#This Row],[مبالغ النموذج]]-الجدول3[[#This Row],[مبالغ المحضر]]","v":0}]
[{"$f":"'نموذج تعبئة فواتير السلف'!A27","v":20},{"$f":"'نموذج تعبئة فواتير السلف'!J27","v":0},{"$f":"'نموذج تعبئة فواتير السلف'!E27","v":0},null,"",{"$f":"الجدول3[[#This Row],[مبالغ النموذج]]-الجدول3[[#This Row],[مبالغ المحضر]]","v":0}]
[{"$f":"'نموذج تعبئة فواتير السلف'!A28","v":21},{"$f":"'نموذج تعبئة فواتير السلف'!J28","v":0},{"$f":"'نموذج تعبئة فواتير السلف'!E28","v":0},1,"û",{"$f":"الجدول3[[#This Row],[مبالغ النموذج]]-الجدول3[[#This Row],[مبالغ المحضر]]","v":-1}]
[{"$f":"'نموذج تعبئة فواتير السلف'!A29","v":22},{"$f":"'نموذج تعبئة فواتير السلف'!J29","v":0},{"$f":"'نموذج تعبئة فواتير السلف'!E29","v":0},null,"",{"$f":"الجدول3[[#This Row],[مبالغ النموذج]]-الجدول3[[#This Row],[مبالغ المحضر]]","v":0}]
[{"$f":"'نموذج تعبئة فواتير السلف'!A30","v":23},{"$f":"'نموذج تعبئة فواتير السلف'!J30","v":0},{"$f":"'نموذج تعبئة فواتير السلف'!E30","v":0},null,"",{"$f":"الجدول3[[#This Row],[مبالغ النموذج]]-الجدول3[[#This Row],[مبالغ المحضر]]","v":0}]
[{"$f":"'نموذج تعبئة فواتير السلف'!A31","v":24},{"$f":"'نموذج تعبئة فواتير السلف'!J31","v":0},{"$f":"'نموذج تعبئة فواتير السلف'!E31","v":0},null,"",{"$f":"الجدول3[[#This Row],[مبالغ النموذج]]-الجدول3[[#This Row],[مبالغ المحضر]]","v":0}]
[{"$f":"'نموذج تعبئة فواتير السلف'!A32","v":25},{"$f":"'نموذج تعبئة فواتير السلف'!J32","v":0},{"$f":"'نموذج تعبئة فواتير السلف'!E32","v":0},null,"",{"$f":"الجدول3[[#This Row],[مبالغ النموذج]]-الجدول3[[#This Row],[مبالغ المحضر]]","v":0}]
[{"$f":"'نموذج تعبئة فواتير السلف'!A33","v":26},{"$f":"'نموذج تعبئة فواتير السلف'!J33","v":0},{"$f":"'نموذج تعبئة فواتير السلف'!E33","v":0},null,"",{"$f":"الجدول3[[#This Row],[مبالغ النموذج]]-الجدول3[[#This Row],[مبالغ المحضر]]","v":0}]
[{"$f":"'نموذج تعبئة فواتير السلف'!A34","v":27},{"$f":"'نموذج تعبئة فواتير السلف'!J34","v":0},{"$f":"'نموذج تعبئة فواتير السلف'!E34","v":0},null,"",{"$f":"الجدول3[[#This Row],[مبالغ النموذج]]-الجدول3[[#This Row],[مبالغ المحضر]]","v":0}]
[{"$f":"'نموذج تعبئة فواتير السلف'!A35","v":28},{"$f":"'نموذج تعبئة فواتير السلف'!J35","v":0},{"$f":"'نموذج تعبئة فواتير السلف'!E35","v":0},null,"",{"$f":"الجدول3[[#This Row],[مبالغ النموذج]]-الجدول3[[#This Row],[مبالغ المحضر]]","v":0}]
[{"$f":"'نموذج تعبئة فواتير السلف'!A36","v":29},{"$f":"'نموذج تعبئة فواتير السلف'!J36","v":0},{"$f":"'نموذج تعبئة فواتير السلف'!E36","v":0},null,"",{"$f":"الجدول3[[#This Row],[مبالغ النموذج]]-الجدول3[[#This Row],[مبالغ المحضر]]","v":0}]
[{"$f":"'نموذج تعبئة فواتير السلف'!A37","v":30},{"$f":"'نموذج تعبئة فواتير السلف'!J37","v":0},{"$f":"'نموذج تعبئة فواتير السلف'!E37","v":0},null,"",{"$f":"الجدول3[[#This Row],[مبالغ النموذج]]-الجدول3[[#This Row],[مبالغ المحضر]]","v":0}]
[{"$f":"'نموذج تعبئة فواتير السلف'!A38","v":31},{"$f":"'نموذج تعبئة فواتير السلف'!J38","v":0},{"$f":"'نموذج تعبئة فواتير السلف'!E38","v":0},null,"",{"$f":"الجدول3[[#This Row],[مبالغ النموذج]]-الجدول3[[#This Row],[مبالغ المحضر]]","v":0}]
[{"$f":"'نموذج تعبئة فواتير السلف'!A39","v":32},{"$f":"'نموذج تعبئة فواتير السلف'!J39","v":0},{"$f":"'نموذج تعبئة فواتير السلف'!E39","v":0},null,"",{"$f":"الجدول3[[#This Row],[مبالغ النموذج]]-الجدول3[[#This Row],[مبالغ المحضر]]","v":0}]
[{"$f":"'نموذج تعبئة فواتير السلف'!A40","v":33},{"$f":"'نموذج تعبئة فواتير السلف'!J40","v":0},{"$f":"'نموذج تعبئة فواتير السلف'!E40","v":0},null,"",{"$f":"الجدول3[[#This Row],[مبالغ النموذج]]-الجدول3[[#This Row],[مبالغ المحضر]]","v":0}]
[{"$f":"'نموذج تعبئة فواتير السلف'!A41","v":34},{"$f":"'نموذج تعبئة فواتير السلف'!J41","v":0},{"$f":"'نموذج تعبئة فواتير السلف'!E41","v":0},null,"",{"$f":"الجدول3[[#This Row],[مبالغ النموذج]]-الجدول3[[#This Row],[مبالغ المحضر]]","v":0}]
[{"$f":"'نموذج تعبئة فواتير السلف'!A42","v":35},{"$f":"'نموذج تعبئة فواتير السلف'!J42","v":0},{"$f":"'نموذج تعبئة فواتير السلف'!E42","v":0},null,"",{"$f":"الجدول3[[#This Row],[مبالغ النموذج]]-الجدول3[[#This Row],[مبالغ المحضر]]","v":0}]
[{"$f":"'نموذج تعبئة فواتير السلف'!A43","v":36},{"$f":"'نموذج تعبئة فواتير السلف'!J43","v":0},{"$f":"'نموذج تعبئة فواتير السلف'!E43","v":0},null,"",{"$f":"الجدول3[[#This Row],[مبالغ النموذج]]-الجدول3[[#This Row],[مبالغ المحضر]]","v":0}]
{"$rows_left_out":316}
{"sheet":"عبدالرحمن السالم","index":3,"n_rows":870,"n_cols":9,"rows_kept":870,"cut":false,"hidden":true,"merged":[]}
["م","رقم الملف","الإســـــــــــــــــــــــــم","المسمى الوظيفي"]
[1,"96873","ابتسام بنت عمهوج بن شرار العتيبي","مساعد إداري"]
[2,"95872","ابتسام خلف سعد المطيري","مساعد إداري"]
[3,"10252","ابتسام سعد فهد الشدي","أستاذ"]
[4,"11430","ابتسام عبدالرحمن محمد الجساس","صيدلي"]
[5,"10940","ابتسام ناصر عبدالله السلطان","صيدلي اول"]
[6,"10974","ابتهال سليمان العبدالله","أستاذ"]
[7,"96344","ابتهال محمد عبدالعزيز الغيث","مراقب طلبة"]
[8,"34085","ابرار عوض عبدالله المطيري","فني"]
[9,"14717","ابراهيم احمد محمد العلى ",0]
[10,"102233","ابراهيم الجيلاني ساليس","أستاذ مساعد"]
[11,"95583","ابراهيم بن عبدالله بن فالح النفيعي العتيبي","فني أجهزة"]
[12,"17041","ابراهيم سليمان عبدالله الخليفى ",0]
[13,"20210","ابراهيم عبدالرحمن الجفالي","أستاذ مشارك"]
[14,"26244","ابراهيم عبدالرحمن خليفه الرويس","صيدلي"]
[15,116926,"ابراهيم عبدالرزاق السويدان","أستاذ مشارك"]
[16,11767,"ابراهيم عبدالله ابراهيم السراء","أستاذ"]
[17,"73231","ابراهيم علي محمد درويش","أستاذ"]
[18,"70373","ابراهيم مصطفى عبدالفتاح الباجورى ",0]
[19,"95542","اثير ناصر حامد محمد ينبعاوي","فني"]
[20,23213,"احلام محمد عمر الحسيني","أستاذ مساعد"]
[21,"77548","احمد بري","أستاذ مشارك"]
[22,"94891","احمد بن مانع بن هادي ال شهي","فني أجهزة"]
[23,"94893","احمد بن هادي بن محمد معشي","فني مختبرات"]
[24,"30129","احمد جمعه محمد عبيد الله","أستاذ مساعد"]
[25,"22649","احمد سعد ثبيت الشهرانى","أخصائي"]
[26,"55890","احمد صديق على خليفه","مساعد باحث"]
[27,27687,"احمد صياح مزيد جعفري العنزي","معيد"]
[28,"75394","احمد عبدالوهاب عبدالمجيد شهبه","باحث"]
[29,"27392","احمد علي احمد ناحي الغامدي","أستاذ مساعد"]
[30,"36260","احمد فاخر فايز الدمرداش","أستاذ مساعد"]
[31,24767,"احمد لا في دوجان العوفي","أستاذ مساعد"]
[32,"23376","احمد محمد هليل شامان","أستاذ مساعد"]
[33,66169,"احمد محمود احمد العفيفى ","أستاذ مساعد"]
[34,"106510","احمد نديم نسيم الدين","أستاذ مشارك"]
[35,"58828","احمد يعقوب مايت","أستاذ"]
[36,"90030","ارم كمال الدين حسين الطاهر","باحثة"]
[37,"100108","اروى بنت صالح بن عبدالمحسن بن ناصر بن مفيريج","مساعد إداري"]
[38,"95062","اروى بنت منصور بن عبيدالله المحمدي","فني"]
[39,"104545","اريج بنت يحي بن رشيد مؤذنه","فني"]
{"$rows_left_out":830}